{"text_format":"1","workbook":"xlsx","n_sheets":12,"sheets":["Shanghai","Qingdao（RORO船）","Keelung","Qingdao","Hongkong","Busan","Bangkok","祝日 (2)","CALL SIGN","祝日","Sheet1","Sheet2"],"not_rendered":{"charts":0,"images":2,"macros":1,"external_links":0,"defined_names":7,"comments":0,"pivot_tables":0},"unopened":[],"bounds":{"document_bytes":16777216,"sheet_cells":100000,"rows_first":2000,"rows_last":500,"rows_between":2000,"halvings":0,"cell_chars":16384,"cell_head_chars":4096},"cells_cut":0,"cells_raw":0,"read":"whole","date_system":"1900"}

{"sheet":"Shanghai","index":0,"n_rows":43,"n_cols":13,"rows_kept":43,"cut":false,"hidden":false,"merged":[[15,2,15,3],[15,14,15,15],[11,2,11,3],[11,14,11,15],[8,2,8,3],[8,14,8,15],[9,2,9,3],[9,14,9,15],[10,2,10,3],[10,14,10,15],[12,2,12,3],[12,14,12,15],[13,2,13,3],[13,14,13,15],[14,2,14,3],[14,14,14,15],[6,2,7,3],[6,4,7,4],[1,12,1,13],[2,12,2,13],[3,12,3,13],[4,12,4,13],[1,2,1,8],[3,2,3,8],[4,8,4,9],[42,1,42,10],[29,1,29,10],[28,3,28,9],[41,2,41,10],[37,2,37,6],[35,12,35,13],[33,12,33,13],[34,12,34,13],[6,5,7,5],[5,6,5,10],[6,8,6,9],[5,12,5,13],[6,12,6,13],[6,6,6,7],[16,2,16,3],[16,14,16,15],[17,2,17,3],[17,14,17,15],[18,2,18,3],[18,14,18,15],[19,2,19,3],[19,14,19,15],[20,2,20,3],[20,14,20,15],[21,2,21,3],[21,14,21,15]]}
[]
[null,null,null,null,null,null,null,null,null,null,null,null,"CHUN JIN"]
[null,null,null,null,null,null,null,null,null,null,null,null,"MILD TEMPO"]
[null,null,null,null,null,null,null,null,null,null,null,null,"MLD WALTZ"]
[null,null,null,null,null,null,null,null,"2024-07-15",null,"更新",null,"GLORY SHENGDON"]
[null,null,null,null,null,null,"上海着岸バース・・・上海明東コンテナターミナル (SMCT 外高橋 5・6期)",null,null,null,null,null,"JJ NAGOYA"]
[null,null,"VESSEL",null,"VOY","CALL","OSAKA",null,"KOBE",null,"SHANGHAI",null,"GLORY GUANGZHOU"]
[null,null,null,null,null,null,"CUT","ETD","CUT","ETD","ETA"]
[null,null,"QIU JIN",null,"2429W",null,{"$f":"I9","v":"2024-07-17"},"2024-07-19","2024-07-17",{"$f":"H9","v":"2024-07-19"},{"$f":"J9+2","v":"2024-07-21"},null,"①日付変える"]
[null,null,"GLORY SHENGDONG",null,{"$f":"E9","v":"2429W"},{"$f":"VLOOKUP(C10,'CALL SIGN'!C:D,2,FALSE)","v":{"$error":"#N/A"}},null,null,"2024-07-19","2024-07-23",{"$f":"J10+2","v":"2024-07-25"}]
[null,null,"QIU JIN",null,"2430W",null,{"$f":"I11","v":"2024-07-24"},"2024-07-26","2024-07-24",{"$f":"H11","v":"2024-07-26"},{"$f":"J11+2","v":"2024-07-28"},null,"①日付変える"]
[null,null,"CONTRIVIA",null,{"$f":"E11","v":"2430W"},{"$f":"VLOOKUP(C12,'CALL SIGN'!C:D,2,FALSE)","v":{"$error":"#N/A"}},null,null,"2024-07-26","2024-07-30",{"$f":"J12+2","v":"2024-08-01"}]
[null,null,"QIU JIN",null,"2431W",null,{"$f":"I13","v":"2024-07-31"},"2024-08-02","2024-07-31",{"$f":"H13","v":"2024-08-02"},{"$f":"J13+2","v":"2024-08-04"},null,"①日付変える"]
[null,null,"後報",null,null,{"$f":"VLOOKUP(C14,'CALL SIGN'!C:D,2,FALSE)","v":{"$error":"#N/A"}},null,null,"後報"]
[null,null,"QIU JIN",null,"2432W",null,{"$f":"I15","v":"2024-08-07"},"2024-08-09","2024-08-07",{"$f":"H15","v":"2024-08-09"},{"$f":"J15+2","v":"2024-08-11"},null,"①日付変える"]
[null,null,"後報",null,null,{"$f":"VLOOKUP(C16,'CALL SIGN'!C:D,2,FALSE)","v":{"$error":"#N/A"}},null,null,"後報"]
[null,null,"QIU JIN",null,"2433W",null,{"$f":"I17","v":"2024-08-14"},"2024-08-16","2024-08-14",{"$f":"H17","v":"2024-08-16"},{"$f":"J17+2","v":"2024-08-18"},null,"①日付変える"]
[null,null,"後報",null,null,{"$f":"VLOOKUP(C18,'CALL SIGN'!C:D,2,FALSE)","v":{"$error":"#N/A"}},null,null,"後報"]
[null,null,"QIU JIN",null,"2434W",null,{"$f":"I19","v":"2024-08-21"},"2024-08-23","2024-08-21",{"$f":"H19","v":"2024-08-23"},{"$f":"J19+2","v":"2024-08-25"},null,"①日付変える"]
[null,null,"後報",null,null,{"$f":"VLOOKUP(C20,'CALL SIGN'!C:D,2,FALSE)","v":{"$error":"#N/A"}},null,null,"後報"]
[null,null,"QIU JIN",null,"2435W",null,{"$f":"I21","v":"2024-08-28"},"2024-08-30","2024-08-28",{"$f":"H21","v":"2024-08-30"},{"$f":"J21+2","v":"2024-09-01"},null,"①日付変える"]
[null,null,"後報",null,null,{"$f":"VLOOKUP(C22,'CALL SIGN'!C:D,2,FALSE)","v":{"$error":"#N/A"}},null,null,"後報"]
[]
[]
[]
[]
[]
[]
[null,null,null,"＊＊＊subject to change with or without notice＊＊＊"]
[null,"　　　　　　　　※　Bookingの最終受付は基本的に　CFS CUT前日の午前中までとさせて頂きます。ご協力の程、宜しくお願い致します。"]
[]
[null,null,null,null,"　上海連絡先事務所　：　株式会社　大運　上海事務所"]
[null,null,null,null,"　上海市延安東路１７５号　　旺角広場１２０９室"]
[null,null,null,null,"      TEL : 86-21-6373-5877",null,null,null,null,null,null,null,"JJ NAGOYA"]
[null,null,null,null,"      FAX : 86-21-6373-2605",null,null,null,null,null,null,null,"QIU JIN"]
[null,null,null,null,null,null,null,null,null,null,null,null,"HARRIER"]
[null,null,"BOOKING/SCHEDULE のお問合せ先",null,null,null,null,"本船基本スケジュール"]
[null,null,"㈱大運　国際物流課　（担当：福島）",null,null,null,null,"CUT 神戸","CUT 大阪","大阪・神戸出港","上海着"]
[null,null,"TEL:06-6120-2027",null,null,null,null,"金曜","金曜","火曜","木曜"]
[null,null,"FAX:06-6120-2029",null,null,null,null,"水曜","水曜","金曜","日曜"]
{"$rows_left_out":4}
{"sheet":"Qingdao（RORO船）","index":1,"n_rows":40,"n_cols":10,"rows_kept":40,"cut":false,"hidden":true,"merged":[[37,1,37,4],[38,1,38,9],[39,0,39,9],[16,1,16,2],[28,0,28,9],[30,0,30,9],[31,0,31,9],[34,1,34,3],[34,6,34,8],[15,1,15,2],[2,1,2,9],[4,1,4,9],[5,5,5,8],[8,1,9,2],[8,3,9,3],[8,4,9,4],[9,6,9,8],[10,1,10,2],[11,1,11,2],[12,1,12,2],[13,1,13,2],[14,1,14,2]]}
[]
[]
[]
[]
[]
[null,null,null,null,null,{"$f":"Shanghai!$I$5","v":"2024-07-15"},null,null,null,"更新"]
[null,"※国内消防法該当貨物は取扱不可となります。"]
[]
[null,"VESSEL",null,"VOY","CALL","CFS CUT","ETA",null,"ETD","ETA"]
[null,null,null,null,null,"OSAKA/KOBE","KOBE",null,null,"QINGDAO"]
[null,"DCL QINGDAO",null,"2307W",{"$error":"#N/A"},{"$f":"WORKDAY(I11,-2,'祝日 (2)'!B139:B155)","v":"2023-02-17"},"2023-02-21","-",{"$f":"+G11","v":"2023-02-21"},{"$f":"I11+3","v":"2023-02-24"}]
[null,"DCL QINGDAO",null,"2308W",{"$error":"#N/A"},{"$f":"WORKDAY(I12,-2,'祝日 (2)'!B139:B155)","v":"2023-02-24"},"2023-02-28","-","2023-02-28","2023-03-03"]
[null,"DCL QINGDAO",null,"2309W",{"$error":"#N/A"},{"$f":"WORKDAY(I13,-2,'祝日 (2)'!B139:B155)","v":"2023-03-03"},"2023-03-07","-","2023-03-07","2023-03-10"]
[null,"DCL QINGDAO",null,"2310W",{"$error":"#N/A"},{"$f":"WORKDAY(I14,-2,'祝日 (2)'!B139:B155)","v":"2023-03-10"},"2023-03-14","-","2023-03-14","2023-03-17"]
[null,"DCL QINGDAO",null,"030W",{"$error":"#N/A"},{"$error":"#REF!"},"2022-11-29","-","2022-11-29","2022-12-02"]
[null,"DCL QINGDAO",null,"031W",{"$error":"#N/A"},{"$error":"#REF!"},"2022-12-06","-","2022-12-06","2022-12-09"]
[null,"DCL QINGDAO",null,"032W",{"$error":"#N/A"},{"$error":"#REF!"},"2022-12-13","-","2022-12-13","2022-12-16"]
[]
[]
[]
[]
[]
[]
[null,null,null,null,"1519W"]
[]
[]
[]
[]
["＊＊＊subject to change with or without notice＊＊＊"]
[]
["　　　　　　　　※　Bookingのご依頼は　dclqd@daiunex.co.jp　へ宜しくお願い致します。"]
["　　　　　　　　※　Bookingの最終受付は基本的に　CFS CUT前日の午前中までとさせて頂きます。ご協力の程、宜しくお願い致します。"]
[]
[null,"BOOKING/SCHEDULE のお問合せ先",null,null,null,"本船基本スケジュール"]
[null,"㈱大運　国際物流課 （担当：谷岡）",null,null,null,"CUT","神戸出港",null,null,"青島着"]
[null,"TEL:06-6120-2027",null,null,null,"金曜","火曜","-","火曜","金曜"]
[null,"FAX:06-6120-2029"]
[]
[null,"下記のURLでもスケジュールをご覧頂けます。　どうぞご利用下さい｡"]
["http://www.daiunex.co.jp/importing/sch.html"]
{"$rows_left_out":1}
{"sheet":"Keelung","index":2,"n_rows":43,"n_cols":13,"rows_kept":43,"cut":false,"hidden":false,"merged":[[33,10,33,12],[2,1,2,7],[4,1,4,7],[5,7,5,8],[7,1,8,2],[7,3,8,3],[7,7,7,8],[7,4,8,4],[7,5,7,6],[9,1,9,2],[21,14,21,16],[21,17,21,19],[47,9,48,9],[41,1,41,9],[42,0,42,9],[36,1,36,3],[36,5,36,6],[39,1,39,3],[47,8,48,8],[38,1,38,3],[36,7,36,8],[47,7,48,7],[37,1,37,3],[47,5,48,5],[47,6,48,6],[9,5,9,9],[11,5,11,9],[33,0,33,9],[32,0,32,9],[10,1,10,2],[11,1,11,2],[12,1,12,2],[16,5,16,9],[17,1,17,2],[18,1,18,2],[19,1,19,2],[20,1,20,2],[13,1,13,2],[14,1,14,2],[15,1,15,2],[16,1,16,2]]}
[]
[]
[]
[]
[]
[null,null,null,null,null,null,null,{"$f":"+Shanghai!I5","v":"2024-07-15"},null,"更新"]
[]
[null,"VESSEL",null,"VOY","CALL","OSAKA",null,"KOBE",null,"KEELUNG"]
[null,null,null,null,null,"CUT","ETD","CUT","ETD","ETA"]
[null,"NO SERVICE",null,"24010S",{"$f":"VLOOKUP(B10,'CALL SIGN'!C:D,2,FALSE)","v":{"$error":"#N/A"}},"船社による航路改編の影響でNO SERVICEとなりました。"]
[null,"YM IMPROVEMENT",null,"249S",{"$f":"VLOOKUP(B11,'CALL SIGN'!C:D,2,FALSE)","v":"A8KS9"},{"$f":"WORKDAY(G11,-2,'祝日 (2)'!B201:B217)","v":"2024-07-18"},"2024-07-21",{"$f":"WORKDAY(F11,-1,'祝日 (2)'!B202:B218)","v":"2024-07-17"},{"$f":"G11","v":"2024-07-21"},{"$f":"I11+3","v":"2024-07-24"},null,"#","本船変更"]
[null,"NO SERVICE",null,"24017S",{"$f":"VLOOKUP(B12,'CALL SIGN'!C:D,2,FALSE)","v":{"$error":"#N/A"}},"船社による航路改編の影響でNO SERVICEとなりました。"]
[null,"YM IMAGE",null,"194S",{"$f":"VLOOKUP(B13,'CALL SIGN'!C:D,2,FALSE)","v":"A8HX3"},{"$f":"WORKDAY(G13,-2,'祝日 (2)'!B203:B219)","v":"2024-07-25"},"2024-07-28",{"$f":"WORKDAY(F13,-1,'祝日 (2)'!B204:B220)","v":"2024-07-24"},{"$f":"G13","v":"2024-07-28"},{"$f":"I13+3","v":"2024-07-31"},null,"#","本船変更"]
[null,"YM INCEPTION",null,"221S",{"$f":"VLOOKUP(B14,'CALL SIGN'!C:D,2,FALSE)","v":{"$error":"#N/A"}},{"$f":"WORKDAY(G14,-2,'祝日 (2)'!B196:B212)","v":"2024-08-01"},"2024-08-04",{"$f":"WORKDAY(F14,-1,'祝日 (2)'!B197:B213)","v":"2024-07-31"},{"$f":"G14","v":"2024-08-04"},{"$f":"I14+3","v":"2024-08-07"}]
["◎","TS PUSAN",null,"24013S",{"$f":"VLOOKUP(B15,'CALL SIGN'!C:D,2,FALSE)","v":{"$error":"#N/A"}},{"$f":"WORKDAY(G15,-2,'祝日 (2)'!B197:B213)","v":"2024-08-02"},"2024-08-06",{"$f":"WORKDAY(F15,-1,'祝日 (2)'!B198:B214)","v":"2024-08-01"},{"$f":"G15+1","v":"2024-08-07"},{"$f":"I15+4","v":"2024-08-11"},null,"#","本船変更"]
[null,"YM IMMENSE",null,"382S",{"$f":"VLOOKUP(B16,'CALL SIGN'!C:D,2,FALSE)","v":{"$error":"#N/A"}},{"$f":"WORKDAY(G16,-2,'祝日 (2)'!B198:B214)","v":"2024-08-08"},"2024-08-11",{"$f":"WORKDAY(F16,-1,'祝日 (2)'!B199:B215)","v":"2024-08-07"},{"$f":"G16","v":"2024-08-11"},{"$f":"I16+3","v":"2024-08-14"}]
["◎","NO SERVICE",null,null,{"$f":"VLOOKUP(B17,'CALL SIGN'!C:D,2,FALSE)","v":{"$error":"#N/A"}},"NO SERVICE",null,null,null,null,null,"#","本船変更"]
[null,"YM IMPROVEMENT",null,"250S",{"$f":"VLOOKUP(B18,'CALL SIGN'!C:D,2,FALSE)","v":"A8KS9"},{"$f":"WORKDAY(G18,-2,'祝日 (2)'!B208:B224)","v":"2024-08-15"},"2024-08-18",{"$f":"WORKDAY(F18,-1,'祝日 (2)'!B209:B225)","v":"2024-08-14"},{"$f":"G18","v":"2024-08-18"},{"$f":"I18+3","v":"2024-08-21"}]
["◎","TS PUSAN",null,"24014S",{"$f":"VLOOKUP(B19,'CALL SIGN'!C:D,2,FALSE)","v":{"$error":"#N/A"}},{"$f":"WORKDAY(G19,-2,'祝日 (2)'!B209:B225)","v":"2024-08-16"},"2024-08-20",{"$f":"WORKDAY(F19,-1,'祝日 (2)'!B210:B226)","v":"2024-08-15"},{"$f":"G19+1","v":"2024-08-21"},{"$f":"I19+4","v":"2024-08-25"},null,"#","本船変更"]
[null,"YM IMAGE",null,"195S",{"$f":"VLOOKUP(B20,'CALL SIGN'!C:D,2,FALSE)","v":"A8HX3"},{"$f":"WORKDAY(G20,-2,'祝日 (2)'!B202:B218)","v":"2024-08-22"},"2024-08-25",{"$f":"WORKDAY(F20,-1,'祝日 (2)'!B203:B219)","v":"2024-08-21"},{"$f":"G20","v":"2024-08-25"},{"$f":"I20+3","v":"2024-08-28"}]
["◎","YM INAUGURATION",null,"303S",{"$f":"VLOOKUP(B21,'CALL SIGN'!C:D,2,FALSE)","v":"BLHE"},{"$f":"WORKDAY(G21,-2,'祝日 (2)'!B203:B219)","v":"2024-08-23"},"2024-08-27",{"$f":"WORKDAY(F21,-1,'祝日 (2)'!B204:B220)","v":"2024-08-22"},{"$f":"G21+1","v":"2024-08-28"},{"$f":"I21+4","v":"2024-09-01"},null,"#","本船変更"]
[null,"◎船社による航路改編のため、CUT,ETD,ETAが変更となります。"]
[]
[]
[]
[]
[]
[null,"※ バンニング場所など変更することがございます。"]
[]
[]
[]
[]
["＊＊＊subject to change with or without notice＊＊＊"]
["　　　　　　　　※　Bookingの最終受付は基本的に　CFS CUT前日の午前中までとさせて頂きます。"]
[]
[null,null,null,null,null,"本船基本スケジュール"]
[null,"BOOKING/SCHEDULE のお問合せ先",null,null,null,"OSAKA",null,"KOBE",null,"KEELUNG"]
[null,"㈱大運　国際物流課　（担当：孫）",null,null,null,"CUT","ETD","CUT","ETD","ETA"]
[null,"TEL:06-6120-2027",null,null,null,"金曜","火-水曜","木曜","火曜","土曜"]
[null,"FAX:06-6120-2029",null,null,null,"水曜","金曜","火曜","金-土曜","月曜"]
{"$rows_left_out":4}
{"sheet":"Qingdao","index":3,"n_rows":33,"n_cols":14,"rows_kept":33,"cut":false,"hidden":false,"merged":[[2,1,2,9],[4,1,4,9],[5,5,5,8],[8,1,9,2],[8,3,9,3],[8,4,9,4],[9,6,9,8],[8,6,8,8],[10,1,10,2],[27,1,27,3],[27,6,27,8],[10,12,10,13],[11,1,11,2],[10,6,10,8],[11,6,11,8],[12,1,12,2],[12,6,12,8],[12,12,12,13],[13,1,13,2],[13,6,13,8],[30,1,30,4],[31,1,31,9],[32,0,32,9],[28,6,28,8],[23,0,23,9],[24,0,24,9]]}
[]
[]
[]
[]
[]
[null,null,null,null,null,"2024-06-30",null,null,null,"更新"]
[null,"※国内消防法該当貨物は取扱不可となります。"]
[]
[null,"VESSEL",null,"VOY","CALL","CFS CUT","ETD",null,null,"ETA"]
[null,null,null,null,null,"KOBE","KOBE",null,null,"QINGDAO",null,null,null,"2245W"]
[null,"INTRA BHUM",null,"2426W",{"$f":"VLOOKUP(Qingdao!B11,#REF!,2,FALSE)","v":{"$error":"#REF!"}},"2024-06-28","2024-07-02",null,null,"2024-07-05",null,null,"ACACIA LIBRA"]
[null,"A SUWA",null,"2427W",null,"2024-07-05","2024-07-09",null,null,{"$f":"G12+3","v":"2024-07-12"}]
[null,"INTRA BHUM",null,"2428W",{"$f":"VLOOKUP(Qingdao!B13,#REF!,2,FALSE)","v":{"$error":"#REF!"}},"2024-07-11","2024-07-16",null,null,{"$f":"G13+3","v":"2024-07-19"},null,null,"ACACIA LIBRA"]
[null,"A SUWA",null,"2429W",null,"2024-07-19","2024-07-23",null,null,{"$f":"G14+3","v":"2024-07-26"}]
[null,null,null,null,null,null,null,null,null,null,null,null,"#","本船名変更"]
[]
[]
[]
[null,null,null,null,"1519W"]
[]
[null,"【お願い】お客様のお荷物もスムーズにお取り扱いする為に、弊社指定CFS倉庫にお送り頂く"]
[null,"お荷物の送り状に「弊社ブッキング番号記載」のご協力をお願い致します。"]
[]
["＊＊＊subject to change with or without notice＊＊＊"]
["　　　　　　　　※　Bookingの最終受付は基本的に　CFS CUT前日の午前中までとさせて頂きます。ご協力の程、宜しくお願い致します。"]
[]
[null,"BOOKING/SCHEDULE のお問合せ先",null,null,null,"本船基本スケジュール"]
[null,"㈱大運　国際物流課　（担当：金森）",null,null,null,"CUT","神戸出港",null,null,"青島着"]
[null,"TEL:06-6120-2027",null,null,null,"金曜","火曜",null,null,"金曜"]
[null,"FAX:06-6120-2029"]
[]
[null,"下記のURLでもスケジュールをご覧頂けます。他の積み地・仕向け地もお問合せ下さい。"]
["http://www.daiunex.co.jp/importing/sch.html"]

{"sheet":"Hongkong","index":4,"n_rows":49,"n_cols":17,"rows_kept":49,"cut":false,"hidden":false,"merged":[[39,0,39,8],[21,1,21,9],[30,0,30,8],[31,0,31,8],[34,1,34,4],[38,1,38,9],[8,1,8,2],[9,1,9,2],[10,1,10,2],[11,1,11,2],[1,1,1,7],[3,1,3,7],[4,6,4,7],[6,1,7,2],[6,3,7,3],[6,4,7,4],[17,1,17,2],[18,1,18,2],[12,1,12,2],[13,1,13,2],[14,1,14,2],[15,1,15,2],[16,1,16,2]]}
[]
[]
[]
[]
[null,null,null,null,null,null,{"$f":"+Shanghai!I5","v":"2024-07-15"},null,"更新"]
[]
[null,"VESSEL",null,"VOY","CALL","CFS CUT","CFS CUT","ETD","ETA"]
[null,null,null,null,null,"OSAKA","KOBE","KOBE","HONGKONG"]
[null,"INTERASIA ENGAGE",null,"S024",null,"2024-07-17","2024-07-18","2024-07-21",{"$f":"H9+4","v":"2024-07-25"}]
[null,"IRENES RAINBOW",null,"004S",{"$f":"VLOOKUP(B10,#REF!,2,FALSE)","v":{"$error":"#REF!"}},"2024-07-19","2024-07-22","2024-07-24",{"$f":"H10+3","v":"2024-07-27"}]
[null,"WAN HAI 327",null,"S041",{"$f":"VLOOKUP(B11,#REF!,2,FALSE)","v":{"$error":"#REF!"}},"2024-07-24","2024-07-25","2024-07-28",{"$f":"H11+4","v":"2024-08-01"}]
["*","BOX ENDEAVOUR",null,"002S",{"$f":"VLOOKUP(B12,#REF!,2,FALSE)","v":{"$error":"#REF!"}},"2024-07-26","2024-07-29","2024-07-31",{"$f":"H12+3","v":"2024-08-03"}]
[null,"WAN HAI 328",null,"S041",null,"2024-07-31","2024-08-01","2024-08-04",{"$f":"H13+4","v":"2024-08-08"}]
[null,"GSL MAREN",null,"005S",{"$f":"VLOOKUP(B14,#REF!,2,FALSE)","v":{"$error":"#REF!"}},"2024-08-02","2024-08-05","2024-08-07",{"$f":"H14+3","v":"2024-08-10"}]
[null,"WAN HAI 365",null,"S018",{"$f":"VLOOKUP(B15,#REF!,2,FALSE)","v":{"$error":"#REF!"}},"2024-08-07","2024-08-08","2024-08-11",{"$f":"H15+4","v":"2024-08-15"}]
[null,"INTERASIA ENGAGE",null,"S025",{"$f":"VLOOKUP(B16,#REF!,2,FALSE)","v":{"$error":"#REF!"}},"2024-08-14","2024-08-15","2024-08-18",{"$f":"H16+4","v":"2024-08-22"}]
[null,"IRENES RAINBOW",null,"005S",null,"2024-08-16","2024-08-19","2024-08-21",{"$f":"H17+3","v":"2024-08-24"}]
[null,"WAN HAI 327",null,"S042",{"$f":"VLOOKUP(B18,#REF!,2,FALSE)","v":{"$error":"#REF!"}},"2024-08-21","2024-08-22","2024-08-25",{"$f":"H18+4","v":"2024-08-29"}]
[null,"BOX ENDEAVOUR",null,"003S",{"$f":"VLOOKUP(B19,#REF!,2,FALSE)","v":{"$error":"#REF!"}},"2024-08-23","2024-08-26","2024-08-28",{"$f":"H19+3","v":"2024-08-31"}]
[null,"大阪CFS CUT日は神戸の１営業日前となります。(＝ETDの３営業日前）"]
[null,"*本船名変更",null,null,null,null,null,null,null,null,"#","本船変更"]
[]
[]
[]
[]
[]
[null,null,null,null,null,null,null,null,null,null,null,null,null,null,null,null,"搬入先倉庫 (※)"]
[null,null,null,null,null,null,null,null,null,null,null,null,null,null,null,null,"CFS CUT"]
[]
[null,null,null,null,null,null,null,null,null,null,null,null,null,null,null,null,"DAIUN (OSA)"]
["＊＊＊subject to change with or without notice＊＊＊",null,null,null,null,null,null,null,null,null,null,null,null,null,null,null,"2022/07/06 (水)"]
["　　　　　　　　※　Bookingの最終受付は基本的に　CFS CUT前日の午前中までとさせて頂きます。ご協力の程、宜しくお願い致します。"]
[null,null,null,null,null,null,null,null,null,null,null,null,null,null,null,null,"DAIUN (OSA)"]
[null,"BOOKING/SCHEDULE のお問合せ先",null,null,null,"本船基本スケジュール",null,null,null,null,null,null,null,null,null,null,"2022/07/08 (金)"]
[null,"㈱大運　国際物流課　（担当：谷岡）",null,null,null,"大阪CUT","神戸CUT","神戸出港","香港着"]
[null,"TEL:06-6120-2027",null,null,null,"水曜","木曜","日曜","木曜",null,null,null,null,null,null,null,"DAIUN (OSA)"]
[null,"FAX:06-6120-2029",null,null,null,"金曜","月曜","水曜","土曜",null,null,null,null,null,null,null,"2022/07/13 (水)"]
[]
[null,"下記のURLでもスケジュールをご覧頂けます。他の積み地・仕向け地もお問合せ下さい。",null,null,null,null,null,null,null,null,null,null,null,null,null,null,"DAIUN (OSA)"]
["http://www.daiunex.co.jp/importing/sch.html",null,null,null,null,null,null,null,null,null,null,null,null,null,null,null,"2022/07/14 (木)"]
{"$rows_left_out":10}
{"sheet":"Busan","index":5,"n_rows":35,"n_cols":14,"rows_kept":35,"cut":false,"hidden":false,"merged":[[9,1,9,2],[10,1,10,2],[11,1,11,2],[12,1,12,2],[25,1,25,7],[27,1,27,4],[34,0,34,7],[14,1,14,9],[23,0,23,7],[24,0,24,7],[33,1,33,9],[2,1,2,7],[4,1,4,7],[5,5,5,6],[7,1,8,2],[7,3,8,3],[7,4,8,4]]}
[]
[]
[]
[]
[]
[null,null,null,null,null,{"$f":"Shanghai!I5","v":"2024-07-15"},null,"更新"]
[]
[null,"VESSEL",null,"VOY","CALL","CFS CUT","ETD","ETA"]
[null,null,null,null,null,"OSAKA","OSAKA","BUSAN"]
[null,"VICTORY STAR",null,"2427W",{"$f":"VLOOKUP(B10,#REF!,2,FALSE)","v":{"$error":"#REF!"}},"2024-07-17",{"$f":"F10+2","v":"2024-07-19"},"2024-07-21",null,null,null,null,null,"2246W"]
[null,{"$f":"B10","v":"VICTORY STAR"},null,"2428W",{"$f":"VLOOKUP(B11,#REF!,2,FALSE)","v":{"$error":"#REF!"}},"2024-07-24","2024-07-26","2024-07-28",null,null,null,null,"MLD WALTZ","2246W"]
[null,{"$f":"B11","v":"VICTORY STAR"},null,"2429W",{"$f":"VLOOKUP(B12,#REF!,2,FALSE)","v":{"$error":"#REF!"}},"2024-07-31","2024-08-02","2024-08-04"]
[null,{"$f":"B12","v":"VICTORY STAR"},null,"2430W",{"$f":"VLOOKUP(B13,#REF!,2,FALSE)","v":{"$error":"#REF!"}},"2024-08-07","2024-08-09","2024-08-11"]
[]
[]
[]
[]
[]
[]
[]
[]
[null,"※ バンニング場所など変更することがございます。"]
[]
["＊＊＊subject to change with or without notice＊＊＊"]
["※　Bookingの最終受付は基本的に　CFS CUT日の午前中までとさせて頂きます。ご協力の程、宜しくお願い致します。"]
[]
[null,"BOOKING/SCHEDULE のお問合せ先"]
[null,"㈱大運　国際物流課　（担当：釘谷）"]
[null,"TEL:06-6120-2027"]
[null,"FAX:06-6120-2029"]
[null,null,null,null,null,"本船基本スケジュール"]
[null,null,null,null,null,"CUT","大阪/神戸出港","釜山着"]
[null,null,null,null,null,"水曜","金曜","日曜"]
[null,"下記のURLでもスケジュールをご覧頂けます。他の積み地・仕向け地もお問合せ下さい。"]
["http://www.daiunex.co.jp/importing/sch.html"]

{"sheet":"Bangkok","index":6,"n_rows":37,"n_cols":20,"rows_kept":37,"cut":false,"hidden":false,"merged":[[2,1,2,9],[4,1,4,9],[5,6,5,8],[7,1,8,2],[7,3,8,3],[7,4,8,4],[7,5,8,5],[36,0,36,9],[16,1,16,2],[17,1,17,9],[17,19,17,20],[26,0,26,9],[27,0,27,9],[34,1,34,5],[35,1,35,9],[14,1,14,2],[15,1,15,2],[9,1,9,2],[10,1,10,2],[11,1,11,2],[12,1,12,2],[13,1,13,2]]}
[]
[]
[]
[]
[]
[null,null,null,null,null,null,{"$f":"Shanghai!I5","v":"2024-07-15"},null,null,"更新"]
[]
[null,"VESSEL",null,"VOY","CARRIER","CALL","CFS CUT","ETD","ETD","ETA"]
[null,null,null,null,null,null,"OSAKA/KOBE","OSAKA","KOBE","BANGKOK"]
[null,"YM IMPROVEMENT",null,"249S","YML",null,"2024-07-18","2024-07-21",{"$f":"H10","v":"2024-07-21"},{"$f":"I10+10","v":"2024-07-31"}]
[null,"YM IMAGE",null,"194S","YML","A8HX3","2024-07-25","2024-07-28","2024-07-28","2024-08-07"]
[null,"YM INCEPTION",null,"221S","YML",null,"2024-08-01","2024-08-04",{"$f":"H12","v":"2024-08-04"},{"$f":"I12+10","v":"2024-08-14"}]
[null,"YM IMMENSE",null,"382S","YML",{"$error":"#N/A"},"2024-08-08","2024-08-11","2024-08-11","2024-08-21"]
[null,"YM IMPROVEMENT",null,"250S","YML",null,"2024-08-15","2024-08-18","2024-08-18","2024-08-28"]
[null,"YM IMAGE",null,"195S","YML","A8HX3","2024-08-22","2024-08-25","2024-08-25","2024-09-04"]
[null,"YM INCEPTION",null,"222S","YML",null,"2024-08-29","2024-09-01",{"$f":"H16","v":"2024-09-01"},{"$f":"I16+10","v":"2024-09-11"}]
[]
[null,null,null,null,null,null,null,null,null,null,null,null,null,null,null,null,null,null,"#","本船変更"]
[]
[]
[]
[]
[]
[]
[]
[]
["＊＊＊subject to change with or without notice＊＊＊"]
["※　Bookingの最終受付は基本的に　CFS CUT日の午前中までとさせて頂きます。ご協力の程、宜しくお願い致します。"]
[]
[]
[null,"BOOKING/SCHEDULE のお問合せ先",null,null,null,null,"本船基本スケジュール"]
[null,"㈱大運　国際物流課　（担当：福島）",null,null,null,null,"CUT","大阪出港","神戸出港","BANGKOK着"]
[null,"TEL:06-6120-2027",null,null,null,null,"木曜","日曜","日曜","翌々水曜"]
[null,"FAX:06-6120-2029"]
[]
[null,"下記のURLでもスケジュールをご覧頂けます。他の積み地・仕向け地もお問合せ下さい。"]
["http://www.daiunex.co.jp/importing/sch.html"]

{"sheet":"祝日 (2)","index":7,"n_rows":169,"n_cols":4,"rows_kept":169,"cut":false,"hidden":true,"merged":[]}
["2016年\n祝日","2016-01-01",{"$f":"TEXT(WEEKDAY(B1,1),\"aaaa\")","v":"金曜日"},"元旦"]
[null,"2016-01-02",{"$f":"TEXT(WEEKDAY(B2,1),\"aaaa\")","v":"土曜日"},"年末年始"]
[null,"2016-01-03","日曜日","年末年始"]
[null,"2016-01-04","月曜日","年末年始"]
[null,"2016-01-11","月曜日","成人の日"]
[null,"2016-02-11","木曜日","建国記念日"]
[null,"2016-03-21","月曜日","春分の日振替"]
[null,"2016-04-29","金曜日","昭和の日"]
[null,"2016-05-03","火曜日","憲法記念日"]
[null,"2016-05-04","水曜日","みどりの日"]
[null,"2016-05-05","木曜日","こどもの日"]
[null,"2016-07-18","月曜日","海の日"]
[null,"2016-08-11","木曜日","山の日"]
[null,"2016-09-19","月曜日","敬老の日"]
[null,"2016-09-22","木曜日","秋分の日"]
[null,"2016-10-10","月曜日","体育の日"]
[null,"2016-11-03","木曜日","文化の日"]
[null,"2016-11-23","水曜日","勤労感謝の日"]
[null,"2016-12-23","金曜日","天皇誕生日"]
[null,"2016-12-29","木曜日","年末年始"]
[null,"2016-12-30","金曜日","年末年始"]
[null,"2016-12-31","土曜日","年末年始"]
["2017年\n祝日","2017-01-01","日曜日","元旦"]
[null,"2017-01-02","月曜日","年末年始"]
[null,"2017-01-03","火曜日","年末年始"]
[null,"2017-01-04","水曜日","年末年始"]
[null,"2017-01-09","月曜日","成人の日"]
[null,"2017-02-11","土曜日","建国記念の日"]
[null,"2017-03-20","月曜日","春分の日"]
[null,"2017-04-29","土曜日","昭和の日"]
[null,"2017-05-03","水曜日","憲法記念日"]
[null,"2017-05-04","木曜日","みどりの日"]
[null,"2017-05-05","金曜日","こどもの日"]
[null,"2017-07-17","月曜日","海の日"]
[null,"2017-08-11","金曜日","山の日"]
[null,"2017-09-18","月曜日","敬老の日"]
[null,"2017-09-23","土曜日","秋分の日"]
[null,"2017-10-09","月曜日","体育の日"]
[null,"2017-11-03","金曜日","文化の日"]
[null,"2017-11-23","木曜日","勤労感謝の日"]
{"$rows_left_out":130}
{"sheet":"CALL SIGN","index":8,"n_rows":131,"n_cols":4,"rows_kept":131,"cut":false,"hidden":true,"merged":[]}
["CARRIER","SCAC","VESSEL","CALL SIGN"]
["MOL","MOLU","ALM WODONGA","5BGY4"]
["MCC","MCPU","ALS VENUS","9V5905"]
["MCC","MCPU","ALS VESTA","9V5904"]
["KLINE","KKLU","ANDERSON BRIDGE","3FTU2"]
["MCC","MCPU","ANNETTE-S.","D6FY5"]
["NYK","NYKS","APOLLON D","A8QD6"]
["NYK","NYKS","ARTEMIS","3ERS4"]
["KLINE","KKLU","BALTIMORE BRIDGE","3ETY2"]
["ONE","ONYE","BANGKOK BRIDGE","3FTZ8"]
["MAERSK","MAEU","BEETHOVEN","D5CE3"]
["NAMSUNG","NSSL","BOHAI STAR","DSFL4"]
["APL","APLU","BOMAR RENAISSANCE","A8JU3"]
["APL","APLU","BOTANY BAY","A8JM5"]
["CMA","11DX","BOX EXPRESS","D5GM6"]
["KLINE","KKLU","BUDAPEST BRIDGE","VRIZ5"]
["CMA",null,"CAPE FELTON","V7OX5"]
["CMA","11DX","CHINDWIN STAR","D5GW8"]
["SJJ","11WJ","CHUN JIN","BIMT"]
["CMA","11DX","CNC NEPTUNE","9V6193"]
["APL","APLU","CORDELIA","A8TL8"]
["ONE",null,"CSL MANHATTAN","D5IC7"]
["DONGJIN",null,"DONGJIN FORTUNE","D7UJ"]
["CMA","11DX","EXPRESS BLACK SEA","9HA2713"]
["APL","APLU","FESCO DALNEGORSK","5BBQ5"]
["WHL","22AA","FRED","5BEX4"]
["WHL","22AA","GH MISTRAL","V7NL3"]
["HAPAG-LLOYD","HLCU","GLASGOW EXPRESS","DDSC2"]
["SJJ","11WJ","GLORY FORTUNE","VRHA9"]
["SJJ","11WJ","GLORY SHANGHAI","VROS4"]
["SJJ","11WJ","GLORY TIANJIN","VROR4"]
["MCC","MCPU","GUAYAQUIL BRIDGE","VRGI8"]
["APL","APLU","GUENTHER SCHULTE","VRGK8"]
["HAPAG-LLOYD","HLCU","HAMMONIA SAPPHIRE","D5GT6"]
["MAERSK","MAEU","HARALD S","V2AD6"]
["HASCO","HASL","HEUNG-A JAKARTA","3ERD6"]
["SINOKOR","SNKO","HEUNG-A SINGAPORE","3REC6"]
["KLINE","KKLU","HORAI BRIDGE","3FOB4"]
["MCC","MCPU","HS ONORE","A8JC9"]
["HAPAG-LLOYD","HLCU","HS SHACKLETON","9HA3403"]
{"$rows_left_out":92}
{"sheet":"祝日","index":9,"n_rows":117,"n_cols":4,"rows_kept":117,"cut":false,"hidden":true,"merged":[]}
["2016年\n祝日","2016-01-01",{"$f":"TEXT(WEEKDAY(B1,1),\"aaaa\")","v":"金曜日"},"元旦"]
[null,"2016-01-02",{"$f":"TEXT(WEEKDAY(B2,1),\"aaaa\")","v":"土曜日"},"年末年始"]
[null,"2016-01-03","日曜日","年末年始"]
[null,"2016-01-04","月曜日","年末年始"]
[null,"2016-01-11","月曜日","成人の日"]
[null,"2016-02-11","木曜日","建国記念日"]
[null,"2016-03-21","月曜日","春分の日振替"]
[null,"2016-04-29","金曜日","昭和の日"]
[null,"2016-05-03","火曜日","憲法記念日"]
[null,"2016-05-04","水曜日","みどりの日"]
[null,"2016-05-05","木曜日","こどもの日"]
[null,"2016-07-18","月曜日","海の日"]
[null,"2016-08-11","木曜日","山の日"]
[null,"2016-09-19","月曜日","敬老の日"]
[null,"2016-09-22","木曜日","秋分の日"]
[null,"2016-10-10","月曜日","体育の日"]
[null,"2016-11-03","木曜日","文化の日"]
[null,"2016-11-23","水曜日","勤労感謝の日"]
[null,"2016-12-23","金曜日","天皇誕生日"]
[null,"2016-12-29","木曜日","年末年始"]
[null,"2016-12-30","金曜日","年末年始"]
[null,"2016-12-31","土曜日","年末年始"]
["2017年\n祝日","2017-01-01","日曜日","元旦"]
[null,"2017-01-02","月曜日","年末年始"]
[null,"2017-01-03","火曜日","年末年始"]
[null,"2017-01-04","水曜日","年末年始"]
[null,"2017-01-09","月曜日","成人の日"]
[null,"2017-02-11","土曜日","建国記念の日"]
[null,"2017-03-20","月曜日","春分の日"]
[null,"2017-04-29","土曜日","昭和の日"]
[null,"2017-05-03","水曜日","憲法記念日"]
[null,"2017-05-04","木曜日","みどりの日"]
[null,"2017-05-05","金曜日","こどもの日"]
[null,"2017-07-17","月曜日","海の日"]
[null,"2017-08-11","金曜日","山の日"]
[null,"2017-09-18","月曜日","敬老の日"]
[null,"2017-09-23","土曜日","秋分の日"]
[null,"2017-10-09","月曜日","体育の日"]
[null,"2017-11-03","金曜日","文化の日"]
[null,"2017-11-23","木曜日","勤労感謝の日"]
{"$rows_left_out":78}
{"sheet":"Sheet1","index":10,"n_rows":0,"n_cols":0,"rows_kept":0,"cut":false,"hidden":true,"merged":[]}

{"sheet":"Sheet2","index":11,"n_rows":0,"n_cols":0,"rows_kept":0,"cut":false,"hidden":true,"merged":[]}